BDBM64565 US9428505, Compound 9
SMILES CN1CCC2(CC1)N(C(=O)NC2=O)c1cc(C)c(CCS(=O)(=O)N2CCC3(CC2)N=C(NC3=O)c2ccc(OC(F)(F)F)cc2)c(C)c1
InChI Key InChIKey=DVPYGUUHRQHZAP-UHFFFAOYSA-N
Data  1 EC50
  Tab Delimited (TSV)   2D SDfile   Computed 3D by Vconf -m prep SDfile
Find this compound or compounds like it in BindingDB:
Activity Spreadsheet -- Enzyme Inhibition Constant Data from BindingDB
Found 1 hit for monomerid = 64565
TargetParathyroid hormone [32-65](Homo sapiens (Human))
Chugai Seiyaku Kabushiki Kaisha
US Patent
LigandPNGBDBM64565(US9428505, Compound 9)
Affinity DataEC50:  1.20E+4nMpH: 7.4Assay Description:HKRK-B7 or LLC-PK1 cells were seeded into a 96-well plate at 1×105 cells/well and incubated overnight. On the following day, 50 μl of cAMP assay...
In DepthDetails US Patent